RESULT SHEET

MASTER OF ARTS IN ISLAMIC STUDIES FIRST SEMESTER

End Semester Examination Nov- Dec 2016

Roll Number NAME OF THE CANDIDATES ENROLLMENT RESULT / REMARK
16MAIS002HY MARIYA HASSAN A165600 PASSED
16MAIS006HY RESHMA ANJUM A165601 PASSED
16MAIS007HY RIZWANA BEGUM A165103 PASSED
16MAIS008HY RUHINA FATIMA A165598 PASSED
16MAIS009HY RUQSANA BEGUM A165604 PASSED
16MAIS010HY SALAHUDDIN A165609 PASSED
16MAIS011HY SHABANA MALIK A165596 PASSED
16MAIS012HY SHAIK A165608 PASSED
16MAIS014HY SYED MUSHTAQ AHMED A165607 PASSED
16MAIS001SR FARHEENA HAFIZ A166560 FAILED IN MAIS101CCT-[UE]; MAIS102CCT-[TM TT]; MAIS103CCT-[TM TT]; MAIS104CCT-[TM TT]; PGEN101AET-[TM TT]; PROMOTED
16MAIS002SR GUL NAZIMA A166556 PASSED
16MAIS003SR HEENA JAN A166557 FAILED IN MAIS104CCT-[TM TT]; PROMOTED
16MAIS004SR NELOFAR JAN A166564 PASSED
16MAIS005SR NIGHAT SULTAN A166567 FAILED IN MAIS102CCT-[TM TT]; MAIS104CCT-[TM TT]; PROMOTED
16MAIS006SR QURATTUL AIN A166555 NOT APPEARED
16MAIS007SR RAIHANA AKHTER A166569 PASSED
16MAIS008SR RAYISTA JAN A166570 FAILED IN MAIS104CCT-[TM TT]; PROMOTED
16MAIS009SR RAZIA BASHIR A166563 FAILED IN MAIS101CCT-[TM TT]; MAIS102CCT-[TM TT]; MAIS104CCT-[TM TT]; PROMOTED
16MAIS010SR REHANA RAHIM A166561 FAILED IN MAIS101CCT-[UE]; MAIS104CCT-[TM TT]; PROMOTED
16MAIS011SR ROZY JAN A166565 FAILED IN MAIS104CCT-[UE]; PROMOTED
16MAIS012SR SHAISTA MOHIUDDIN A166566 FAILED IN MAIS101CCT-[UE]; MAIS104CCT-[TM TT]; PROMOTED
16MAIS013SR SHAMEEMA MUNSHI A166559 FAILED IN MAIS101CCT-[TM TT]; MAIS102CCT-[TM TT]; PROMOTED
16MAIS014SR SHANU AKHTER A166568 FAILED IN MAIS104CCT-[TM TT]; PROMOTED
16MAIS015SR SOBIYA MAJEED A166558 PASSED
16MAIS016SR ULFATH A166571 NOT APPEARED
16MAIS017SR ZEESHAN AKHTER A166562 PASSED

A PHP Error was encountered

Severity: Core Warning

Message: PHP Startup: Unable to load dynamic library 'C:\Program Files (x86)\PHP\v5.6\ext\php_sqlsrv_56_ts.dll' - The specified module could not be found.

Filename: Unknown

Line Number: 0

Backtrace: